Reaction Details
TargetMaltase-glucoamylase
LigandBDBM50330956
Substrate/Competitorn/a
Meas. Tech.ChEMBL_684093 (CHEMBL1286470)
Ki 2300±n/a nM
Citation Mohan, SSim, LRose, DRPinto, BM Probing the active-site requirements of human intestinal N-terminal maltase-glucoamylase: Synthesis and enzyme inhibitory activities of a six-membered ring nitrogen analogue of kotalanol and its de-O-sulfonated derivative. Bioorg Med Chem18:7794-8 (2010) 
 
Maltase-glucoamylase
Name:Maltase-glucoamylase
Type:Enzyme
Mol. Mass.:209817.06
Organism:Homo sapiens (Human)
Description:O43451
Residue:1857
BDBM50330956
NameBDBM50330956
Synonyms:7'-[(1,5-Dideoxy-1,5-imino-D-glucitol)-5-N-ammonium]-7'-deoxy-D-perseitol-5'-sulfate | CHEMBL1277062
TypeSmall organic molecule
Emp. Form.C13H27NO13S
Mol. Mass.437.417
SMILESOC[C@H](O)[C@@H](O)[C@@H](O)[C@H](OS([O-])(=O)=O)[C@H](O)C[NH+]1C[C@H](O)[C@@H](O)[C@H](O)[C@H]1CO