Reaction Details
TargetSialidase-3
LigandBDBM50331675
Substrate/Competitorn/a
Meas. Tech.ChEMBL_687674 (CHEMBL1291058)
IC50 300000±n/a nM
Citation Zou, YAlbohy, ASandbhor, MCairo, CW Inhibition of human neuraminidase 3 (NEU3) by C9-triazole derivatives of 2,3-didehydro-N-acetyl-neuraminic acid. Bioorg Med Chem Lett20:7529-33 (2010) 
 
Sialidase-3
Name:Sialidase-3
Type:PROTEIN
Mol. Mass.:48257.99
Organism:Homo sapiens (Human)
Description:ChEMBL_461856
Residue:428
BDBM50331675
NameBDBM50331675
Synonyms:(2R,3R,4S)-3-acetamido-2-((1R,2R)-3-(4-ethoxy-1H-1,2,3-triazol-1-yl)-1,2-dihydroxypropyl)-4-hydroxy-3,4-dihydro-2H-pyran-6-carboxylate | CHEMBL1289540
TypeSmall organic molecule
Emp. Form.C15H22N4O8
Mol. Mass.386.3572
SMILESCCOc1cn(C[C@@H](O)[C@@H](O)[C@@H]2OC(=C[C@H](O)[C@H]2NC(C)=O)C(O)=O)nn1