Reaction Details
TargetSialidase-3
LigandBDBM50331676
Substrate/Competitorn/a
Meas. Tech.ChEMBL_687674 (CHEMBL1291058)
IC50 130000±n/a nM
Citation Zou, YAlbohy, ASandbhor, MCairo, CW Inhibition of human neuraminidase 3 (NEU3) by C9-triazole derivatives of 2,3-didehydro-N-acetyl-neuraminic acid. Bioorg Med Chem Lett20:7529-33 (2010) 
 
Sialidase-3
Name:Sialidase-3
Type:PROTEIN
Mol. Mass.:48257.99
Organism:Homo sapiens (Human)
Description:ChEMBL_461856
Residue:428
BDBM50331676
NameBDBM50331676
Synonyms:(2R,3R,4S)-3-acetamido-2-((1R,2R)-3-(4-(diethoxymethyl)-1H-1,2,3-triazol-1-yl)-1,2-dihydroxypropyl)-4-hydroxy-3,4-dihydro-2H-pyran-6-carboxylate | CHEMBL1289541
TypeSmall organic molecule
Emp. Form.C18H28N4O9
Mol. Mass.444.4363
SMILESCCOC(OCC)c1cn(C[C@@H](O)[C@@H](O)[C@@H]2OC(=C[C@H](O)[C@H]2NC(C)=O)C(O)=O)nn1