Reaction Details
TargetSialidase-3
LigandBDBM50331680
Substrate/Competitorn/a
Meas. Tech.ChEMBL_687674 (CHEMBL1291058)
IC50 500000±n/a nM
Citation Zou, YAlbohy, ASandbhor, MCairo, CW Inhibition of human neuraminidase 3 (NEU3) by C9-triazole derivatives of 2,3-didehydro-N-acetyl-neuraminic acid. Bioorg Med Chem Lett20:7529-33 (2010) 
 
Sialidase-3
Name:Sialidase-3
Type:PROTEIN
Mol. Mass.:48257.99
Organism:Homo sapiens (Human)
Description:ChEMBL_461856
Residue:428
BDBM50331680
NameBDBM50331680
Synonyms:(2R,3R,4S)-3-acetamido-2-((1R,2R)-1,2-dihydroxy-3-(4-(3-hydroxypropyl)-1H-1,2,3-triazol-1-yl)propyl)-4-hydroxy-3,4-dihydro-2H-pyran-6-carboxylate | CHEMBL1289755
TypeSmall organic molecule
Emp. Form.C16H24N4O8
Mol. Mass.400.3838
SMILESCC(=O)N[C@@H]1[C@@H](O)C=C(O[C@H]1[C@H](O)[C@H](O)Cn1cc(CCCO)nn1)C(O)=O