Reaction Details
TargetSialidase-3
LigandBDBM50331682
Substrate/Competitorn/a
Meas. Tech.ChEMBL_687674 (CHEMBL1291058)
IC50 21000±n/a nM
Citation Zou, YAlbohy, ASandbhor, MCairo, CW Inhibition of human neuraminidase 3 (NEU3) by C9-triazole derivatives of 2,3-didehydro-N-acetyl-neuraminic acid. Bioorg Med Chem Lett20:7529-33 (2010) 
 
Sialidase-3
Name:Sialidase-3
Type:PROTEIN
Mol. Mass.:48257.99
Organism:Homo sapiens (Human)
Description:ChEMBL_461856
Residue:428
BDBM50331682
NameBDBM50331682
Synonyms:(2R,3R,4S)-3-(2-azidoacetamido)-4-hydroxy-2-((1R,2R)-1,2,3-trihydroxypropyl)-3,4-dihydro-2H-pyran-6-carboxylate | CHEMBL1289862
TypeSmall organic molecule
Emp. Form.C11H16N4O8
Mol. Mass.332.2667
SMILESOC[C@@H](O)[C@@H](O)[C@@H]1OC(=C[C@H](O)[C@H]1NC(=O)CN=[N+]=[N-])C(O)=O