Reaction Details
TargetSialidase-3
LigandBDBM50330326
Substrate/Competitorn/a
Meas. Tech.ChEMBL_687672 (CHEMBL1291056)
IC50 7000±n/a nM
Citation Zou, YAlbohy, ASandbhor, MCairo, CW Inhibition of human neuraminidase 3 (NEU3) by C9-triazole derivatives of 2,3-didehydro-N-acetyl-neuraminic acid. Bioorg Med Chem Lett20:7529-33 (2010) 
 
Sialidase-3
Name:Sialidase-3
Type:PROTEIN
Mol. Mass.:48257.99
Organism:Homo sapiens (Human)
Description:ChEMBL_461856
Residue:428
BDBM50330326
NameBDBM50330326
Synonyms:(4S,5R,6R)-5-Acetylamino-4-guanidino-6-((1R,3R)-1,2,3-trihydroxy-propyl)-5,6-dihydro-4H-pyran-2-carboxylic acid (4S,5R,6R)-5-Acetylamino-4-guanidino-6-(1,2,3-trihydroxy-propyl)-5,6-dihydro-4H-pyran-2-carboxylic acid (4S,5R,6R)-5-acetylamino-4-guanidino-6-((1R,2R)-1,2,3-trihydroxy-propy)-5,6-dihydro-4H-pyran-2-carboxylic acid 4-diaminomethylamino-3-methylcarboxamido-2-(1,2,3-trihydroxypropyl)-(3R)-3,4-dihydro-2H-6-pyrancarboxylic acid(Zanamivir) 5-Acetylamino-4-guanidino-6-(1,2,3-trihydroxy-propyl)-5,6-dihydro-4H-pyran-2-carboxylic acid(zanamivir) CHEMBL222813 Relenza | Zanamivi
TypeSmall organic molecule
Emp. Form.C12H20N4O7
Mol. Mass.332.3098
SMILES[#6]-[#6](=O)-[#7]-[#6@@H]-1-[#6@H](-[#6]=[#6](-[#8]-[#6@H]-1-[#6@H](-[#8])-[#6@H](-[#8])-[#6]-[#8])-[#6](-[#8])=O)\[#7]=[#6](\[#7])-[#7]