Reaction Details
TargetCarbonic anhydrase 1
LigandBDBM26985
Substrate/Competitorn/a
Meas. Tech.ChEMBL_700699 (CHEMBL1645738)
Ki 1200±n/a nM
Citation Ekinci, DCeyhun, SBSentürk, MErdem, DKüfrevioglu, OISupuran, CT Characterization and anions inhibition studies of ana-carbonic anhydrase from the teleost fish Dicentrarchus labrax. Bioorg Med Chem19:744-8 (2011) 
 
Carbonic anhydrase 1
Name:Carbonic anhydrase 1
Type:Enzyme
Mol. Mass.:28873.37
Organism:Homo sapiens (Human)
Description:P00915
Residue:261
BDBM26985
NameBDBM26985
Synonyms:2-triaza-1,2-diyne CHEMBL89295 azide
TypeIon
Emp. Form.N3
Mol. Mass.42.0206
SMILES[N-]=[N+]=[N-]