Reaction Details
TargetCarbonic anhydrase 1
LigandBDBM26980
Substrate/Competitorn/a
Meas. Tech.ChEMBL_700699 (CHEMBL1645738)
Ki 4000000±n/a nM
Citation Ekinci, DCeyhun, SBSentürk, MErdem, DKüfrevioglu, OISupuran, CT Characterization and anions inhibition studies of ana-carbonic anhydrase from the teleost fish Dicentrarchus labrax. Bioorg Med Chem19:744-8 (2011) 
 
Carbonic anhydrase 1
Name:Carbonic anhydrase 1
Type:Enzyme
Mol. Mass.:28873.37
Organism:Homo sapiens (Human)
Description:P00915
Residue:261
BDBM26980
NameBDBM26980
Synonyms:Br- CHEMBL1644694 bromide ion
TypeIon
Emp. Form.Br
Mol. Mass.79.905
SMILES[Br-]