Reaction Details
TargetCarbonic anhydrase 5A, mitochondrial
LigandBDBM26988
Substrate/Competitorn/a
Meas. Tech.ChEMBL_700697 (CHEMBL1645736)
Ki 16000000±n/a nM
Citation Ekinci, DCeyhun, SBSentürk, MErdem, DKüfrevioglu, OISupuran, CT Characterization and anions inhibition studies of ana-carbonic anhydrase from the teleost fish Dicentrarchus labrax. Bioorg Med Chem19:744-8 (2011) 
 
Carbonic anhydrase 5A, mitochondrial
Name:Carbonic anhydrase 5A, mitochondrial
Type:Enzyme
Mol. Mass.:34755.54
Organism:Homo sapiens (Human)
Description:Human (cloned) isozyme
Residue:305
BDBM26988
NameBDBM26988
Synonyms:CHEMBL1644029 CHEMBL186200 nitrate ion | nitrooxidane
TypeIon
Emp. Form.NO3
Mol. Mass.62.0054
SMILES[O-][N+]([O-])=O