Reaction Details
TargetCarbonic anhydrase 9
LigandBDBM26985
Substrate/Competitorn/a
Meas. Tech.ChEMBL_700696 (CHEMBL1645735)
Ki 5000±n/a nM
Citation Ekinci, DCeyhun, SBSentürk, MErdem, DKüfrevioglu, OISupuran, CT Characterization and anions inhibition studies of ana-carbonic anhydrase from the teleost fish Dicentrarchus labrax. Bioorg Med Chem19:744-8 (2011) 
 
Carbonic anhydrase 9
Name:Carbonic anhydrase 9
Type:Enzyme
Mol. Mass.:49669.03
Organism:Homo sapiens (Human)
Description:Catalytic domain of human cloned isozyme was used in the assay
Residue:459
BDBM26985
NameBDBM26985
Synonyms:2-triaza-1,2-diyne CHEMBL89295 azide
TypeIon
Emp. Form.N3
Mol. Mass.42.0206
SMILES[N-]=[N+]=[N-]