Reaction Details
TargetAcetylcholinesterase
LigandBDBM50334303
Substrate/Competitorn/a
Meas. Tech.ChEMBL_699909 (CHEMBL1646128)
Ki 100±n/a nM
Citation Musilek, KRoder, JKomloova, MHolas, OHrabinova, MPohanka, MDohnal, VOpletalova, VKuca, KJung, YS Preparation, in vitro screening and molecular modelling of symmetrical 4-tert-butylpyridinium cholinesterase inhibitors--analogues of SAD-128. Bioorg Med Chem Lett21:150-4 (2010) 
 
Acetylcholinesterase
Name:Acetylcholinesterase
Type:Enzyme
Mol. Mass.:67792.70
Organism:Homo sapiens (Human)
Description:P22303
Residue:614
BDBM50334303
NameBDBM50334303
Synonyms:1,1'-bis(4-tert.butylpyridinium)-naphtyl-3,6-dimethylenyl dibromide | CHEMBL1642988
TypeSmall organic molecule
Emp. Form.C30H36N2
Mol. Mass.424.6191
SMILESCC(C)(C)c1cc[n+](\C=C2\CC3=C\C(CC=C3C=C2)=C\[n+]2ccc(cc2)C(C)(C)C)cc1