Reaction Details
TargetCholinesterase
LigandBDBM50334300
Substrate/Competitorn/a
Meas. Tech.ChEMBL_699910 (CHEMBL1646129)
Ki 200±n/a nM
Citation Musilek, KRoder, JKomloova, MHolas, OHrabinova, MPohanka, MDohnal, VOpletalova, VKuca, KJung, YS Preparation, in vitro screening and molecular modelling of symmetrical 4-tert-butylpyridinium cholinesterase inhibitors--analogues of SAD-128. Bioorg Med Chem Lett21:150-4 (2010) 
 
Cholinesterase
Name:Cholinesterase
Type:Homotetramer
Mol. Mass.:68422.27
Organism:Homo sapiens (Human)
Description:P06276
Residue:602
BDBM50334300
NameBDBM50334300
Synonyms:1,8-bis(4-tert.butylpyridinium)-oct-1,8-diyl dibromide | CHEMBL1642977
TypeSmall organic molecule
Emp. Form.C26H42N2
Mol. Mass.382.624
SMILESCC(C)(C)c1cc[n+](CCCCCCCC[n+]2ccc(cc2)C(C)(C)C)cc1