Reaction Details
TargetC-C chemokine receptor type 5
LigandBDBM50334986
Substrate/Competitorn/a
Meas. Tech.ChEMBL_702660 (CHEMBL1657596)
IC50 0.2±n/a nM
Citation Galan, SRJones, RMSmith, NNDorr, PKWestby, MPerruccio, FRodrigues, D An imidazopiperidine series of CCR5 antagonists for the treatment of HIV: the discovery of N-{(1S)-1-(3-fluorophenyl)-3-[(3-endo)-3-(5-isobutyryl-2-methyl-4,5,6,7-tetrahydro-1H-imidazo[4,5-c]pyridin-1-yl)-8-azabicyclo[3.2.1]oct-8-yl]propyl}acetamide (PF-232798). J Med Chem54:67-77 (2011) 
 
C-C chemokine receptor type 5
Name:C-C chemokine receptor type 5
Type:Enzyme
Mol. Mass.:40540.21
Organism:Homo sapiens (Human)
Description:P51681
Residue:352
BDBM50334986
NameBDBM50334986
Synonyms:4,4-Difluoro-cyclohexanecarboxylic acid {(S)-3-[(1S,5S)-3-(3-isopropyl-5-methyl-[1,2,4]triazol-4-yl)-8-aza-bicyclo[3.2.1]oct-8-yl]-1-phenyl-propyl}-amide 4,4-difluoro-N-((S)-3-((1S,3S,5R)-3-(3-isopropyl-5-methyl-4H-1,2,4-triazol-4-yl)-8-aza-bicyclo[3.2.1]octan-8-yl)-1-phenylpropyl)cyclohexanecarboxamide CHEMBL1201187 Selzentry | UK-427857
TypeSmall organic molecule
Emp. Form.C29H41F2N5O
Mol. Mass.513.6655
SMILESCC(C)c1nnc(C)n1[C@H]1C[C@@H]2CC[C@H](C1)N2CC[C@H](NC(=O)C1CCC(F)(F)CC1)c1ccccc1