Reaction Details
TargetSodium/glucose cotransporter 1
LigandBDBM50335143
Substrate/Competitorn/a
Meas. Tech.ChEMBL_702890 (CHEMBL1655515)
EC50 461.6±n/a nM
Citation Chang, CCChao, YSChen, CTChiu, CHChu, KFHsiao, WCHsieh, CJYuan, MCHsieh, TCHuang, CYHung, MSLee, JCLiu, YWSong, JSTsai, CHWang, MHWu, SHYao, CHYeh, TK Discovery of novel N-ß-D-xylosylindole derivatives as sodium-dependent glucose cotransporter 2 (SGLT2) inhibitors for the management of hyperglycemia in diabetes. J Med Chem54:166-78 (2011) 
 
Sodium/glucose cotransporter 1
Name:Sodium/glucose cotransporter 1
Type:Protein
Mol. Mass.:73503.78
Organism:Homo sapiens (Human)
Description:P13866
Residue:664
BDBM50335143
NameBDBM50335143
Synonyms:4-Chloro-3-[4-(methylsulfanyl)benzyl]-1-(beta-D-xylopyranosyl)-1H-indole | CHEMBL1650499
TypeSmall organic molecule
Emp. Form.C21H22ClNO4S
Mol. Mass.419.922
SMILESCSc1ccc(Cc2cn([C@@H]3OC[C@@H](O)[C@H](O)[C@H]3O)c3cccc(Cl)c23)cc1