Reaction Details
TargetAurora kinase B
LigandBDBM50335178
Substrate/Competitorn/a
Meas. Tech.ChEMBL_701675 (CHEMBL1656567)
IC50 198±n/a nM
Citation Kerekes, ADEsposite, SJTagat, JRXiao, YTerracina, GA Aurora kinase inhibitors based on the imidazo[1,2-a]pyrazine core: fluorine and deuterium incorporation improve oral absorption and exposure. J Med Chem54:201-10 (2011) 
 
Aurora kinase B
Name:Aurora kinase B
Type:Protein
Mol. Mass.:39327.72
Organism:Homo sapiens (Human)
Description:Q96GD4
Residue:344
BDBM50335178
NameBDBM50335178
Synonyms:2-Methyl-2-[[[5-[[6-methyl-3-(1H-pyrazol-4-yl)imidazo[1,2-a]pyrazin-8-yl]amino]-3-isothiazolyl]methyl](2,2,2-trifluoroethyl)amino]-1-propanol Hydrochloride | CHEMBL1650535
TypeSmall organic molecule
Emp. Form.C20H23F3N8OS
Mol. Mass.480.51
SMILESCc1cn2c(cnc2c(Nc2cc(CN(CC(F)(F)F)C(C)(C)CO)ns2)n1)-c1cn[nH]c1