Reaction Details
TargetReceptor-type tyrosine-protein kinase FLT3
LigandBDBM50335188
Substrate/Competitorn/a
Meas. Tech.ChEMBL_701565 (CHEMBL1656204)
IC50 76±n/a nM
Citation Kerekes, ADEsposite, SJTagat, JRXiao, YTerracina, GA Aurora kinase inhibitors based on the imidazo[1,2-a]pyrazine core: fluorine and deuterium incorporation improve oral absorption and exposure. J Med Chem54:201-10 (2011) 
 
Receptor-type tyrosine-protein kinase FLT3
Name:Receptor-type tyrosine-protein kinase FLT3
Type:Enzyme
Mol. Mass.:112888.62
Organism:Homo sapiens (Human)
Description:P36888
Residue:993
BDBM50335188
NameBDBM50335188
Synonyms:CHEMBL1650545 N-[3-[(3,3-Difluoro-1-pyrrolidinyl)methyl]-5-isothiazolyl]-6-methyl-3-(1H-pyrazol-4-yl)imidazo[1,2-a]pyrazin-8-amine Hydrochloride
TypeSmall organic molecule
Emp. Form.C18H18F2N8S
Mol. Mass.416.451
SMILESCc1cn2c(cnc2c(Nc2cc(CN3CCC(F)(F)C3)ns2)n1)-c1cn[nH]c1