Reaction Details
TargetInsulin-like growth factor 1 receptor
LigandBDBM50335188
Substrate/Competitorn/a
Meas. Tech.ChEMBL_701555 (CHEMBL1656194)
IC50>100±n/a nM
Citation Kerekes, ADEsposite, SJTagat, JRXiao, YTerracina, GA Aurora kinase inhibitors based on the imidazo[1,2-a]pyrazine core: fluorine and deuterium incorporation improve oral absorption and exposure. J Med Chem54:201-10 (2011) 
 
Insulin-like growth factor 1 receptor
Name:Insulin-like growth factor 1 receptor
Type:Protein
Mol. Mass.:154776.79
Organism:Homo sapiens (Human)
Description:P08069
Residue:1367
BDBM50335188
NameBDBM50335188
Synonyms:CHEMBL1650545 N-[3-[(3,3-Difluoro-1-pyrrolidinyl)methyl]-5-isothiazolyl]-6-methyl-3-(1H-pyrazol-4-yl)imidazo[1,2-a]pyrazin-8-amine Hydrochloride
TypeSmall organic molecule
Emp. Form.C18H18F2N8S
Mol. Mass.416.451
SMILESCc1cn2c(cnc2c(Nc2cc(CN3CCC(F)(F)C3)ns2)n1)-c1cn[nH]c1