Reaction Details
TargetTyrosine-protein kinase JAK2
LigandBDBM50335214
Substrate/Competitorn/a
Meas. Tech.ChEMBL_701697 (CHEMBL1656589)
IC50 10±n/a nM
Citation Ioannidis, SLamb, MLWang, TAlmeida, LBlock, MHDavies, AMPeng, BSu, MZhang, HJHoffmann, ERivard, CGreen, IHoward, TPollard, HRead, JAlimzhanov, MBebernitz, GBell, KYe, MHuszar, DZinda, M Discovery of 5-chloro-N2-[(1S)-1-(5-fluoropyrimidin-2-yl)ethyl]-N4-(5-methyl-1H-pyrazol-3-yl)pyrimidine-2,4-diamine (AZD1480) as a novel inhibitor of the Jak/Stat pathway. J Med Chem54:262-76 (2011) 
 
Tyrosine-protein kinase JAK2
Name:Tyrosine-protein kinase JAK2
Type:Protein
Mol. Mass.:130684.68
Organism:Homo sapiens (Human)
Description:O60674
Residue:1132
BDBM50335214
NameBDBM50335214
Synonyms:5-bromo-N2-[(1S)-1-(5-fluoropyrimidin-2-yl)ethyl]-N4-(5-methyl-1H-pyrazol-3-yl)pyrimidine-2,4-diamine | CHEMBL1650729
TypeSmall organic molecule
Emp. Form.C14H14BrFN8
Mol. Mass.393.217
SMILESC[C@H](Nc1ncc(Br)c(Nc2cc(C)n[nH]2)n1)c1ncc(F)cn1