Reaction Details
TargetSignal transducer and activator of transcription 3
LigandBDBM50335201
Substrate/Competitorn/a
Meas. Tech.ChEMBL_701695 (CHEMBL1656587)
IC50 23±n/a nM
Citation Ioannidis, SLamb, MLWang, TAlmeida, LBlock, MHDavies, AMPeng, BSu, MZhang, HJHoffmann, ERivard, CGreen, IHoward, TPollard, HRead, JAlimzhanov, MBebernitz, GBell, KYe, MHuszar, DZinda, M Discovery of 5-chloro-N2-[(1S)-1-(5-fluoropyrimidin-2-yl)ethyl]-N4-(5-methyl-1H-pyrazol-3-yl)pyrimidine-2,4-diamine (AZD1480) as a novel inhibitor of the Jak/Stat pathway. J Med Chem54:262-76 (2011) 
 
Signal transducer and activator of transcription 3
Name:Signal transducer and activator of transcription 3
Type:Protein
Mol. Mass.:88064.31
Organism:Homo sapiens (Human)
Description:P40763
Residue:770
BDBM50335201
NameBDBM50335201
Synonyms:5-Chloro-N2-[(1S)-1-(5-fluoropyrimidin-2-yl)ethyl]-N4-(5-methyl-1H-pyrazol-3-yl)pyrimidine-2,4-diamine | CHEMBL1231124
TypeSmall organic molecule
Emp. Form.C14H14ClFN8
Mol. Mass.348.766
SMILESC[C@H](Nc1ncc(Cl)c(Nc2cc(C)n[nH]2)n1)c1ncc(F)cn1