Reaction Details
TargetPeptidyl-prolyl cis-trans isomerase FKBP1A
LigandBDBM50335225
Substrate/Competitorn/a
Meas. Tech.ChEMBL_701872 (CHEMBL1657164)
Ki 230±n/a nM
Citation Juli, CSippel, MJäger, JThiele, AWeiwad, MSchweimer, KRösch, PSteinert, MSotriffer, CAHolzgrabe, U Pipecolic acid derivatives as small-molecule inhibitors of the Legionella MIP protein. J Med Chem54:277-83 (2011) 
 
Peptidyl-prolyl cis-trans isomerase FKBP1A
Name:Peptidyl-prolyl cis-trans isomerase FKBP1A
Type:Isomerase
Mol. Mass.:11953.09
Organism:Homo sapiens (Human)
Description:P62942
Residue:108
BDBM50335225
NameBDBM50335225
Synonyms:(S)-1-Phenylmethanesulfonyl-piperidine-2-carboxylic acid 3-(3,4,5-trimethoxy-phenyl)-propyl ester CHEMBL109278
TypeSmall organic molecule
Emp. Form.C25H33NO7S
Mol. Mass.491.597
SMILESCOc1cc(CCCOC(=O)[C@@H]2CCCCN2S(=O)(=O)Cc2ccccc2)cc(OC)c1OC