Reaction Details
TargetTranslocator protein
LigandBDBM50335258
Substrate/Competitorn/a
Meas. Tech.ChEMBL_702766 (CHEMBL1655209)
Ki 19.5±n/a nM
Citation Pike, VWTaliani, SLohith, TGOwen, DRPugliesi, IDa Pozzo, EHong, JZoghbi, SSGunn, RNParker, CARabiner, EAFujita, MInnis, RBMartini, CDa Settimo, F Evaluation of novel N1-methyl-2-phenylindol-3-ylglyoxylamides as a new chemotype of 18 kDa translocator protein-selective ligand suitable for the development of positron emission tomography radioligands. J Med Chem54:366-73 (2011) 
 
Translocator protein
Name:Translocator protein
Type:Mitochondrion membrane protein
Mol. Mass.:18945.84
Organism:Rattus norvegicus (rat)
Description:Competitive binding experiments were performed on rat kidney mitochondrial membranes.
Residue:169
BDBM50335258
NameBDBM50335258
Synonyms:2-(1-methyl-2-phenyl-1H-indol-3-yl)-2-oxo-N,N-dipropylacetamide | CHEMBL1651224
TypeSmall organic molecule
Emp. Form.C23H26N2O2
Mol. Mass.362.4647
SMILESCCCN(CCC)C(=O)C(=O)c1c(-c2ccccc2)n(C)c2ccccc12