Reaction Details
TargetTranslocator protein
LigandBDBM50335267
Substrate/Competitorn/a
Meas. Tech.ChEMBL_702766 (CHEMBL1655209)
Ki 19.8±n/a nM
Citation Pike, VWTaliani, SLohith, TGOwen, DRPugliesi, IDa Pozzo, EHong, JZoghbi, SSGunn, RNParker, CARabiner, EAFujita, MInnis, RBMartini, CDa Settimo, F Evaluation of novel N1-methyl-2-phenylindol-3-ylglyoxylamides as a new chemotype of 18 kDa translocator protein-selective ligand suitable for the development of positron emission tomography radioligands. J Med Chem54:366-73 (2011) 
 
Translocator protein
Name:Translocator protein
Type:Mitochondrion membrane protein
Mol. Mass.:18945.84
Organism:Rattus norvegicus (rat)
Description:Competitive binding experiments were performed on rat kidney mitochondrial membranes.
Residue:169
BDBM50335267
NameBDBM50335267
Synonyms:2-(2-(4-fluorophenyl)-1-methyl-1H-indol-3-yl)-2-oxo-N,N-dipropylacetamide | CHEMBL1651233
TypeSmall organic molecule
Emp. Form.C23H25FN2O2
Mol. Mass.380.4552
SMILESCCCN(CCC)C(=O)C(=O)c1c(-c2ccc(F)cc2)n(C)c2ccccc12