Reaction Details
TargetTranslocator protein
LigandBDBM50335269
Substrate/Competitorn/a
Meas. Tech.ChEMBL_702766 (CHEMBL1655209)
Ki 6.77±n/a nM
Citation Pike, VWTaliani, SLohith, TGOwen, DRPugliesi, IDa Pozzo, EHong, JZoghbi, SSGunn, RNParker, CARabiner, EAFujita, MInnis, RBMartini, CDa Settimo, F Evaluation of novel N1-methyl-2-phenylindol-3-ylglyoxylamides as a new chemotype of 18 kDa translocator protein-selective ligand suitable for the development of positron emission tomography radioligands. J Med Chem54:366-73 (2011) 
 
Translocator protein
Name:Translocator protein
Type:Mitochondrion membrane protein
Mol. Mass.:18945.84
Organism:Rattus norvegicus (rat)
Description:Competitive binding experiments were performed on rat kidney mitochondrial membranes.
Residue:169
BDBM50335269
NameBDBM50335269
Synonyms:CHEMBL1651235 | N-benzyl-2-(2-(4-fluorophenyl)-1-methyl-1H-indol-3-yl)-N-methyl-2-oxoacetamide
TypeSmall organic molecule
Emp. Form.C25H21FN2O2
Mol. Mass.400.4448
SMILESCN(Cc1ccccc1)C(=O)C(=O)c1c(-c2ccc(F)cc2)n(C)c2ccccc12