Reaction Details
TargetTranslocator protein
LigandBDBM50143223
Substrate/Competitorn/a
Meas. Tech.ChEMBL_702767 (CHEMBL1655210)
Ki 12.2±n/a nM
Citation Pike, VWTaliani, SLohith, TGOwen, DRPugliesi, IDa Pozzo, EHong, JZoghbi, SSGunn, RNParker, CARabiner, EAFujita, MInnis, RBMartini, CDa Settimo, F Evaluation of novel N1-methyl-2-phenylindol-3-ylglyoxylamides as a new chemotype of 18 kDa translocator protein-selective ligand suitable for the development of positron emission tomography radioligands. J Med Chem54:366-73 (2011) 
 
Translocator protein
Name:Translocator protein
Type:Mitochondrion membrane protein
Mol. Mass.:18945.84
Organism:Rattus norvegicus (rat)
Description:Competitive binding experiments were performed on rat kidney mitochondrial membranes.
Residue:169
BDBM50143223
NameBDBM50143223
Synonyms:2-Oxo-2-(2-phenyl-1H-indol-3-yl)-N,N-dipropyl-acetamide CHEMBL56058
TypeSmall organic molecule
Emp. Form.C22H24N2O2
Mol. Mass.348.4382
SMILESCCCN(CCC)C(=O)C(=O)c1c([nH]c2ccccc12)-c1ccccc1