Reaction Details
TargetPeroxisome proliferator-activated receptor delta
LigandBDBM50176605
Substrate/Competitorn/a
Meas. Tech.ChEMBL_702775 (CHEMBL1655218)
EC50 23±n/a nM
Citation Ohashi, MOyama, TNakagome, ISatoh, MNishio, YNobusada, HHirono, SMorikawa, KHashimoto, YMiyachi, H Design, synthesis, and structural analysis of phenylpropanoic acid-type PPAR¿-selective agonists: discovery of reversed stereochemistry-activity relationship. J Med Chem54:331-41 (2011) 
 
Peroxisome proliferator-activated receptor delta
Name:Peroxisome proliferator-activated receptor delta
Type:Enzyme
Mol. Mass.:49910.45
Organism:Homo sapiens (Human)
Description:Q03181
Residue:441
BDBM50176605
NameBDBM50176605
Synonyms:(S)-2-(3-((3-fluoro-4-(trifluoromethyl)benzamido)methyl)-4-methoxybenzyl)butanoic acid | CHEMBL202118
TypeSmall organic molecule
Emp. Form.C21H21F4NO4
Mol. Mass.427.3894
SMILESCC[C@@H](Cc1ccc(OC)c(CNC(=O)c2ccc(c(F)c2)C(F)(F)F)c1)C(O)=O