Reaction Details
TargetCathepsin S
LigandBDBM50335276
Substrate/Competitorn/a
Meas. Tech.ChEMBL_702783 (CHEMBL1655226)
Ki 1.5±n/a nM
Citation Frizler, MLohr, FFurtmann, NKläs, JGütschow, M Structural optimization of azadipeptide nitriles strongly increases association rates and allows the development of selective cathepsin inhibitors. J Med Chem54:396-400 (2011) 
 
Cathepsin S
Name:Cathepsin S
Type:Protein
Mol. Mass.:37507.38
Organism:Homo sapiens (Human)
Description:P25774
Residue:331
BDBM50335276
NameBDBM50335276
Synonyms:CHEMBL1651242 | N-(Benzyloxycarbonyl)-valyl-methylazalanine-nitrile
TypeSmall organic molecule
Emp. Form.C16H22N4O3
Mol. Mass.318.3709
SMILESCC(C)[C@H](NC(=O)OCc1ccccc1)C(=O)N(C)N(C)C#N