Reaction Details
TargetCathepsin S
LigandBDBM50335278
Substrate/Competitorn/a
Meas. Tech.ChEMBL_702783 (CHEMBL1655226)
Ki 0.2±n/a nM
Citation Frizler, MLohr, FFurtmann, NKläs, JGütschow, M Structural optimization of azadipeptide nitriles strongly increases association rates and allows the development of selective cathepsin inhibitors. J Med Chem54:396-400 (2011) 
 
Cathepsin S
Name:Cathepsin S
Type:Protein
Mol. Mass.:37507.38
Organism:Homo sapiens (Human)
Description:P25774
Residue:331
BDBM50335278
NameBDBM50335278
Synonyms:CHEMBL1651352 | N-(Benzyloxycarbonyl)-cyclohexylalanyl-methylazalanine-nitrile
TypeSmall organic molecule
Emp. Form.C20H28N4O3
Mol. Mass.372.4613
SMILESCN(C#N)N(C)C(=O)[C@H](CC1CCCCC1)NC(=O)OCc1ccccc1