Reaction Details
TargetCathepsin S
LigandBDBM50335281
Substrate/Competitorn/a
Meas. Tech.ChEMBL_702783 (CHEMBL1655226)
Ki 0.16±n/a nM
Citation Frizler, MLohr, FFurtmann, NKläs, JGütschow, M Structural optimization of azadipeptide nitriles strongly increases association rates and allows the development of selective cathepsin inhibitors. J Med Chem54:396-400 (2011) 
 
Cathepsin S
Name:Cathepsin S
Type:Protein
Mol. Mass.:37507.38
Organism:Homo sapiens (Human)
Description:P25774
Residue:331
BDBM50335281
NameBDBM50335281
Synonyms:CHEMBL1651355 | N-(Phenylcarbamoyl)-leucyl-methylazaalanine-nitrile
TypeSmall organic molecule
Emp. Form.C16H23N5O2
Mol. Mass.317.3861
SMILESCC(C)C[C@H](NC(=O)Nc1ccccc1)C(=O)N(C)N(C)C#N