Reaction Details
TargetCathepsin S
LigandBDBM50335285
Substrate/Competitorn/a
Meas. Tech.ChEMBL_702783 (CHEMBL1655226)
Ki 0.32±n/a nM
Citation Frizler, MLohr, FFurtmann, NKläs, JGütschow, M Structural optimization of azadipeptide nitriles strongly increases association rates and allows the development of selective cathepsin inhibitors. J Med Chem54:396-400 (2011) 
 
Cathepsin S
Name:Cathepsin S
Type:Protein
Mol. Mass.:37507.38
Organism:Homo sapiens (Human)
Description:P25774
Residue:331
BDBM50335285
NameBDBM50335285
Synonyms:CHEMBL1651350 acs.jmedchem.1c00409_ST.407
TypeSmall organic molecule
Emp. Form.C22H25N7O3S
Mol. Mass.467.544
SMILESCC(C)C[C@H](NC(=O)Nc1ccc(cc1)-c1noc(n1)-c1cccs1)C(=O)N(C)N(C)C#N