Reaction Details
TargetAurora kinase B
LigandBDBM50335338
Substrate/Competitorn/a
Meas. Tech.ChEMBL_701579 (CHEMBL1656338)
IC50>100000±n/a nM
Citation Prime, MECourtney, SMBrookfield, FAMarston, RWWalker, VWarne, JBoyd, AEKairies, NAvon der Saal, WLimberg, AGeorges, GEngh, RAGoller, BRueger, PRueth, M Phthalazinone pyrazoles as potent, selective, and orally bioavailable inhibitors of Aurora-A kinase. J Med Chem54:312-9 (2011) 
 
Aurora kinase B
Name:Aurora kinase B
Type:Protein
Mol. Mass.:39327.72
Organism:Homo sapiens (Human)
Description:Q96GD4
Residue:344
BDBM50335338
NameBDBM50335338
Synonyms:4-(5-Methyl-1H-pyrazol-3-ylamino)-2-[2-oxo-2-(4-trifluoromethylphenyl)ethyl]-2H-phthalazin-1-one | CHEMBL1651486
TypeSmall organic molecule
Emp. Form.C21H16F3N5O2
Mol. Mass.427.3792
SMILESCc1cc(Nc2nn(CC(=O)c3ccc(cc3)C(F)(F)F)c(=O)c3ccccc23)[nH]n1