Reaction Details
TargetAurora kinase B
LigandBDBM50335328
Substrate/Competitorn/a
Meas. Tech.ChEMBL_701579 (CHEMBL1656338)
IC50 67000±n/a nM
Citation Prime, MECourtney, SMBrookfield, FAMarston, RWWalker, VWarne, JBoyd, AEKairies, NAvon der Saal, WLimberg, AGeorges, GEngh, RAGoller, BRueger, PRueth, M Phthalazinone pyrazoles as potent, selective, and orally bioavailable inhibitors of Aurora-A kinase. J Med Chem54:312-9 (2011) 
 
Aurora kinase B
Name:Aurora kinase B
Type:Protein
Mol. Mass.:39327.72
Organism:Homo sapiens (Human)
Description:Q96GD4
Residue:344
BDBM50335328
NameBDBM50335328
Synonyms:2-[2-(3-Methoxyphenyl)-2-oxoethyl]-4-(5-methyl-1H-pyrazol-3-ylamino)-2H-phthalazin-1-one | CHEMBL1651485
TypeSmall organic molecule
Emp. Form.C21H19N5O3
Mol. Mass.389.4073
SMILESCOc1cccc(c1)C(=O)Cn1nc(Nc2cc(C)n[nH]2)c2ccccc2c1=O