Reaction Details
TargetAurora kinase B
LigandBDBM50335334
Substrate/Competitorn/a
Meas. Tech.ChEMBL_701579 (CHEMBL1656338)
IC50>100000±n/a nM
Citation Prime, MECourtney, SMBrookfield, FAMarston, RWWalker, VWarne, JBoyd, AEKairies, NAvon der Saal, WLimberg, AGeorges, GEngh, RAGoller, BRueger, PRueth, M Phthalazinone pyrazoles as potent, selective, and orally bioavailable inhibitors of Aurora-A kinase. J Med Chem54:312-9 (2011) 
 
Aurora kinase B
Name:Aurora kinase B
Type:Protein
Mol. Mass.:39327.72
Organism:Homo sapiens (Human)
Description:Q96GD4
Residue:344
BDBM50335334
NameBDBM50335334
Synonyms:2-(4-Fluorophenyl)-4-(5-methyl-1H-pyrazol-3-ylamino)-2Hphthalazin-1-one | CHEMBL1651473
TypeSmall organic molecule
Emp. Form.C18H14FN5O
Mol. Mass.335.3351
SMILESCc1cc(Nc2nn(-c3ccc(F)cc3)c(=O)c3ccccc23)[nH]n1