Reaction Details
TargetAurora kinase B
LigandBDBM50249420
Substrate/Competitorn/a
Meas. Tech.ChEMBL_701579 (CHEMBL1656338)
IC50>100000±n/a nM
Citation Prime, MECourtney, SMBrookfield, FAMarston, RWWalker, VWarne, JBoyd, AEKairies, NAvon der Saal, WLimberg, AGeorges, GEngh, RAGoller, BRueger, PRueth, M Phthalazinone pyrazoles as potent, selective, and orally bioavailable inhibitors of Aurora-A kinase. J Med Chem54:312-9 (2011) 
 
Aurora kinase B
Name:Aurora kinase B
Type:Protein
Mol. Mass.:39327.72
Organism:Homo sapiens (Human)
Description:Q96GD4
Residue:344
BDBM50249420
NameBDBM50249420
Synonyms:4-(5-methyl-1H-pyrazol-3-ylamino)-2-(2-oxo-2-phenylethyl)phthalazin-1(2H)-one | CHEMBL474651
TypeSmall organic molecule
Emp. Form.C20H17N5O2
Mol. Mass.359.3813
SMILESCc1cc(Nc2nn(CC(=O)c3ccccc3)c(=O)c3ccccc23)[nH]n1