Reaction Details
TargetAurora kinase B
LigandBDBM50335336
Substrate/Competitorn/a
Meas. Tech.ChEMBL_701579 (CHEMBL1656338)
IC50>100000±n/a nM
Citation Prime, MECourtney, SMBrookfield, FAMarston, RWWalker, VWarne, JBoyd, AEKairies, NAvon der Saal, WLimberg, AGeorges, GEngh, RAGoller, BRueger, PRueth, M Phthalazinone pyrazoles as potent, selective, and orally bioavailable inhibitors of Aurora-A kinase. J Med Chem54:312-9 (2011) 
 
Aurora kinase B
Name:Aurora kinase B
Type:Protein
Mol. Mass.:39327.72
Organism:Homo sapiens (Human)
Description:Q96GD4
Residue:344
BDBM50335336
NameBDBM50335336
Synonyms:2-(3,5-Difluorobenzyl)-4-(5-methyl-1H-pyrazol-3-ylamino)-2H-phthalazin-1-one | CHEMBL1651462
TypeSmall organic molecule
Emp. Form.C19H15F2N5O
Mol. Mass.367.3521
SMILESCc1cc(Nc2nn(Cc3cc(F)cc(F)c3)c(=O)c3ccccc23)[nH]n1