Reaction Details
TargetAurora kinase A
LigandBDBM50335324
Substrate/Competitorn/a
Meas. Tech.ChEMBL_701578 (CHEMBL1656337)
IC50 56±n/a nM
Citation Prime, MECourtney, SMBrookfield, FAMarston, RWWalker, VWarne, JBoyd, AEKairies, NAvon der Saal, WLimberg, AGeorges, GEngh, RAGoller, BRueger, PRueth, M Phthalazinone pyrazoles as potent, selective, and orally bioavailable inhibitors of Aurora-A kinase. J Med Chem54:312-9 (2011) 
 
Aurora kinase A
Name:Aurora kinase A
Type:Serine/threonine-protein kinase
Mol. Mass.:45830.98
Organism:Homo sapiens (Human)
Description:O14965
Residue:403
BDBM50335324
NameBDBM50335324
Synonyms:2-(4-Toluylsulfonate)-4-(5-methyl-1H-pyrazol-3-ylamino)-2H-phthalazin-1-one | CHEMBL1651477
TypeSmall organic molecule
Emp. Form.C20H19N5O3S
Mol. Mass.409.462
SMILESCc1cc(Nc2nn(Cc3ccc(cc3)S(C)(=O)=O)c(=O)c3ccccc23)[nH]n1