Reaction Details
TargetAurora kinase A
LigandBDBM50249210
Substrate/Competitorn/a
Meas. Tech.ChEMBL_701578 (CHEMBL1656337)
IC50 66±n/a nM
Citation Prime, MECourtney, SMBrookfield, FAMarston, RWWalker, VWarne, JBoyd, AEKairies, NAvon der Saal, WLimberg, AGeorges, GEngh, RAGoller, BRueger, PRueth, M Phthalazinone pyrazoles as potent, selective, and orally bioavailable inhibitors of Aurora-A kinase. J Med Chem54:312-9 (2011) 
 
Aurora kinase A
Name:Aurora kinase A
Type:Serine/threonine-protein kinase
Mol. Mass.:45830.98
Organism:Homo sapiens (Human)
Description:O14965
Residue:403
BDBM50249210
NameBDBM50249210
Synonyms:4-(5-methyl-1H-pyrazol-3-ylamino)-2-(2,2,2-trifluoroethyl)phthalazin-1(2H)-one | CHEMBL470718
TypeSmall organic molecule
Emp. Form.C14H12F3N5O
Mol. Mass.323.2732
SMILESCc1cc(Nc2nn(CC(F)(F)F)c(=O)c3ccccc23)[nH]n1