Reaction Details
TargetAurora kinase A
LigandBDBM50335328
Substrate/Competitorn/a
Meas. Tech.ChEMBL_701578 (CHEMBL1656337)
IC50 100±n/a nM
Citation Prime, MECourtney, SMBrookfield, FAMarston, RWWalker, VWarne, JBoyd, AEKairies, NAvon der Saal, WLimberg, AGeorges, GEngh, RAGoller, BRueger, PRueth, M Phthalazinone pyrazoles as potent, selective, and orally bioavailable inhibitors of Aurora-A kinase. J Med Chem54:312-9 (2011) 
 
Aurora kinase A
Name:Aurora kinase A
Type:Serine/threonine-protein kinase
Mol. Mass.:45830.98
Organism:Homo sapiens (Human)
Description:O14965
Residue:403
BDBM50335328
NameBDBM50335328
Synonyms:2-[2-(3-Methoxyphenyl)-2-oxoethyl]-4-(5-methyl-1H-pyrazol-3-ylamino)-2H-phthalazin-1-one | CHEMBL1651485
TypeSmall organic molecule
Emp. Form.C21H19N5O3
Mol. Mass.389.4073
SMILESCOc1cccc(c1)C(=O)Cn1nc(Nc2cc(C)n[nH]2)c2ccccc2c1=O