Reaction Details
TargetAurora kinase A
LigandBDBM50335325
Substrate/Competitorn/a
Meas. Tech.ChEMBL_701578 (CHEMBL1656337)
IC50 115±n/a nM
Citation Prime, MECourtney, SMBrookfield, FAMarston, RWWalker, VWarne, JBoyd, AEKairies, NAvon der Saal, WLimberg, AGeorges, GEngh, RAGoller, BRueger, PRueth, M Phthalazinone pyrazoles as potent, selective, and orally bioavailable inhibitors of Aurora-A kinase. J Med Chem54:312-9 (2011) 
 
Aurora kinase A
Name:Aurora kinase A
Type:Serine/threonine-protein kinase
Mol. Mass.:45830.98
Organism:Homo sapiens (Human)
Description:O14965
Residue:403
BDBM50335325
NameBDBM50335325
Synonyms:2-Isobutyl-4-(5-methyl-1H-pyrazol-3-ylamino)-2H-phthalazin-1-one | CHEMBL1651490
TypeSmall organic molecule
Emp. Form.C16H19N5O
Mol. Mass.297.355
SMILESCC(C)Cn1nc(Nc2cc(C)n[nH]2)c2ccccc2c1=O