Reaction Details
TargetAurora kinase A
LigandBDBM50335326
Substrate/Competitorn/a
Meas. Tech.ChEMBL_701578 (CHEMBL1656337)
IC50 550±n/a nM
Citation Prime, MECourtney, SMBrookfield, FAMarston, RWWalker, VWarne, JBoyd, AEKairies, NAvon der Saal, WLimberg, AGeorges, GEngh, RAGoller, BRueger, PRueth, M Phthalazinone pyrazoles as potent, selective, and orally bioavailable inhibitors of Aurora-A kinase. J Med Chem54:312-9 (2011) 
 
Aurora kinase A
Name:Aurora kinase A
Type:Serine/threonine-protein kinase
Mol. Mass.:45830.98
Organism:Homo sapiens (Human)
Description:O14965
Residue:403
BDBM50335326
NameBDBM50335326
Synonyms:CHEMBL1651491 | N-(4-((4-(1H-pyrazol-3-ylamino)-1-oxophthalazin-2(1H)-yl)methyl)phenyl)acetamide
TypeSmall organic molecule
Emp. Form.C20H18N6O2
Mol. Mass.374.3959
SMILESCC(=O)Nc1ccc(Cn2nc(Nc3ccn[nH]3)c3ccccc3c2=O)cc1