Reaction Details
TargetDelta-type opioid receptor
LigandBDBM50335571
Substrate/Competitorn/a
Meas. Tech.ChEMBL_714498 (CHEMBL1659156)
Ki 258±n/a nM
Citation Hayashi, SNakata, EMorita, AMizuno, KYamamura, KKato, AOhashi, K Discovery of {1-[4-(2-{hexahydropyrrolo[3,4-c]pyrrol-2(1H)-yl}-1H-benzimidazol-1-yl)piperidin-1-yl]cyclooctyl}methanol, systemically potent novel non-peptide agonist of nociceptin/orphanin FQ receptor as analgesic for the treatment of neuropathic pain: design, synthesis, and structure-activity rela Bioorg Med Chem18:7675-99 (2010) 
 
Delta-type opioid receptor
Name:Delta-type opioid receptor
Type:G Protein-Coupled Receptor (GPCR)
Mol. Mass.:40382.98
Organism:Homo sapiens (Human)
Description:Competition binding assays were carried out using membrane preparations from transfected HN9.10 cells that constitutively expressed the delta opioid receptor.
Residue:372
BDBM50335571
NameBDBM50335571
Synonyms:CHEMBL1650845 | {1-[4-(2-{5-Benzylhexahydropyrrolo[3,4-c]pyrrol-2(1H)-yl}-1H-benzimidazol-1-yl)piperidin-1-yl]cyclooctyl}methanol
TypeSmall organic molecule
Emp. Form.C34H47N5O
Mol. Mass.541.7699
SMILESOCC1(CCCCCCC1)N1CCC(CC1)n1c(nc2ccccc12)N1CC2CN(Cc3ccccc3)CC2C1