Reaction Details
TargetHistamine H3 receptor
LigandBDBM22904
Substrate/Competitorn/a
Meas. Tech.ChEMBL_714790 (CHEMBL1663596)
IC50 1.5±n/a nM
Citation Hayashi, SNakata, EMorita, AMizuno, KYamamura, KKato, AOhashi, K Discovery of {1-[4-(2-{hexahydropyrrolo[3,4-c]pyrrol-2(1H)-yl}-1H-benzimidazol-1-yl)piperidin-1-yl]cyclooctyl}methanol, systemically potent novel non-peptide agonist of nociceptin/orphanin FQ receptor as analgesic for the treatment of neuropathic pain: design, synthesis, and structure-activity rela Bioorg Med Chem18:7675-99 (2010) 
 
Histamine H3 receptor
Name:Histamine H3 receptor
Type:G Protein-Coupled Receptor (GPCR)
Mol. Mass.:48607.98
Organism:Rattus norvegicus (rat)
Description:n/a
Residue:445
BDBM22904
NameBDBM22904
Synonyms:(2R)-1-(1H-imidazol-5-yl)propan-2-amine Alpha-Methylhistamine-R CHEMBL268229 RAMH
TypeSmall organic molecule
Emp. Form.C6H11N3
Mol. Mass.125.1716
SMILESC[C@@H](N)Cc1cnc[nH]1