Reaction Details
TargetTyrosine 3-monooxygenase
LigandBDBM37633
Substrate/Competitorn/a
Meas. Tech.ChEMBL_714884 (CHEMBL1663830)
IC50 1.4±n/a nM
Citation Hayashi, SNakata, EMorita, AMizuno, KYamamura, KKato, AOhashi, K Discovery of {1-[4-(2-{hexahydropyrrolo[3,4-c]pyrrol-2(1H)-yl}-1H-benzimidazol-1-yl)piperidin-1-yl]cyclooctyl}methanol, systemically potent novel non-peptide agonist of nociceptin/orphanin FQ receptor as analgesic for the treatment of neuropathic pain: design, synthesis, and structure-activity rela Bioorg Med Chem18:7675-99 (2010) 
 
Tyrosine 3-monooxygenase
Name:Tyrosine 3-monooxygenase
Type:PROTEIN
Mol. Mass.:55960.29
Organism:Rattus norvegicus
Description:ChEMBL_714884
Residue:498
BDBM37633
NameBDBM37633
Synonyms:(2S)-2-amino-3-(4-hydroxy-3-iodo-phenyl)propionic acid (2S)-2-azanyl-3-(3-iodanyl-4-oxidanyl-phenyl)propanoic acid 3-Iodo-L-tyrosine (I-Tyr) Monoiodotyrosine cid_439744
TypeSmall organic molecule
Emp. Form.C9H10INO3
Mol. Mass.307.0851
SMILESN[C@@H](Cc1ccc(O)c(I)c1)C(O)=O