Reaction Details
TargetMuscarinic acetylcholine receptor M3
LigandBDBM50176065
Substrate/Competitorn/a
Meas. Tech.ChEMBL_714795 (CHEMBL1663601)
IC50 1.9±n/a nM
Citation Hayashi, SNakata, EMorita, AMizuno, KYamamura, KKato, AOhashi, K Discovery of {1-[4-(2-{hexahydropyrrolo[3,4-c]pyrrol-2(1H)-yl}-1H-benzimidazol-1-yl)piperidin-1-yl]cyclooctyl}methanol, systemically potent novel non-peptide agonist of nociceptin/orphanin FQ receptor as analgesic for the treatment of neuropathic pain: design, synthesis, and structure-activity rela Bioorg Med Chem18:7675-99 (2010) 
 
Muscarinic acetylcholine receptor M3
Name:Muscarinic acetylcholine receptor M3
Type:Enzyme
Mol. Mass.:66151.03
Organism:Homo sapiens (Human)
Description:P20309
Residue:590
BDBM50176065
NameBDBM50176065
Synonyms:4-DAMP Acetic acid 4-[(4-acetoxy-phenyl)-pyridin-2-yl-methyl]-phenyl ester CHEMBL76897
TypeSmall organic molecule
Emp. Form.C21H26NO2
Mol. Mass.324.4361
SMILESC[N+]1(C)CCC(CC1)OC(=O)C(c1ccccc1)c1ccccc1