Reaction Details
TargetNociceptin receptor
LigandBDBM50335571
Substrate/Competitorn/a
Meas. Tech.ChEMBL_714495 (CHEMBL1659153)
Ki 6.6±n/a nM
Citation Hayashi, SNakata, EMorita, AMizuno, KYamamura, KKato, AOhashi, K Discovery of {1-[4-(2-{hexahydropyrrolo[3,4-c]pyrrol-2(1H)-yl}-1H-benzimidazol-1-yl)piperidin-1-yl]cyclooctyl}methanol, systemically potent novel non-peptide agonist of nociceptin/orphanin FQ receptor as analgesic for the treatment of neuropathic pain: design, synthesis, and structure-activity rela Bioorg Med Chem18:7675-99 (2010) 
 
Nociceptin receptor
Name:Nociceptin receptor
Type:G Protein-Coupled Receptor (GPCR)
Mol. Mass.:40702.87
Organism:Homo sapiens (Human)
Description:P41146
Residue:370
BDBM50335571
NameBDBM50335571
Synonyms:CHEMBL1650845 | {1-[4-(2-{5-Benzylhexahydropyrrolo[3,4-c]pyrrol-2(1H)-yl}-1H-benzimidazol-1-yl)piperidin-1-yl]cyclooctyl}methanol
TypeSmall organic molecule
Emp. Form.C34H47N5O
Mol. Mass.541.7699
SMILESOCC1(CCCCCCC1)N1CCC(CC1)n1c(nc2ccccc12)N1CC2CN(Cc3ccccc3)CC2C1