Reaction Details
TargetNociceptin receptor
LigandBDBM50335572
Substrate/Competitorn/a
Meas. Tech.ChEMBL_714495 (CHEMBL1659153)
Ki 81±n/a nM
Citation Hayashi, SNakata, EMorita, AMizuno, KYamamura, KKato, AOhashi, K Discovery of {1-[4-(2-{hexahydropyrrolo[3,4-c]pyrrol-2(1H)-yl}-1H-benzimidazol-1-yl)piperidin-1-yl]cyclooctyl}methanol, systemically potent novel non-peptide agonist of nociceptin/orphanin FQ receptor as analgesic for the treatment of neuropathic pain: design, synthesis, and structure-activity rela Bioorg Med Chem18:7675-99 (2010) 
 
Nociceptin receptor
Name:Nociceptin receptor
Type:G Protein-Coupled Receptor (GPCR)
Mol. Mass.:40702.87
Organism:Homo sapiens (Human)
Description:P41146
Residue:370
BDBM50335572
NameBDBM50335572
Synonyms:CHEMBL1650846 | Methyl 1-{4-[2-(4-methylpiperazin-1-yl)-1H-benzimidazol-1-yl]piperidin-1-yl}cyclooctanecarboxylate
TypeSmall organic molecule
Emp. Form.C27H41N5O2
Mol. Mass.467.6467
SMILESCOC(=O)C1(CCCCCCC1)N1CCC(CC1)n1c(nc2ccccc12)N1CCN(C)CC1