Reaction Details
TargetMetabotropic glutamate receptor 4
LigandBDBM50263669
Substrate/Competitorn/a
Meas. Tech.ChEMBL_725845 (CHEMBL1678441)
EC50 4740±n/a nM
Citation Engers, DWField, JRLe, UZhou, YBolinger, JDZamorano, RBlobaum, ALJones, CKJadhav, SWeaver, CDConn, PJLindsley, CWNiswender, CMHopkins, CR Discovery, synthesis, and structure-activity relationship development of a series of N-(4-acetamido)phenylpicolinamides as positive allosteric modulators of metabotropic glutamate receptor 4 (mGlu(4)) with CNS exposure in rats. J Med Chem54:1106-10 (2011) 
 
Metabotropic glutamate receptor 4
Name:Metabotropic glutamate receptor 4
Type:Protein
Mol. Mass.:101899.95
Organism:Homo sapiens (Human)
Description:Q14833
Residue:912
BDBM50263669
NameBDBM50263669
Synonyms:(1aS,7aS)-7-(hydroxyimino)-N-phenyl-1,1a,7,7a-tetrahydrocyclopropa[b]chromene-1a-carboxamide
TypeSmall organic molecule
Emp. Form.C17H14N2O3
Mol. Mass.294.3047
SMILESO=NC1[C@@H]2C[C@@]2(Oc2ccccc12)C(=O)Nc1ccccc1