Reaction Details
TargetAdenosine receptor A2a
LigandBDBM50336729
Substrate/Competitorn/a
Meas. Tech.ChEMBL_718204 (CHEMBL1679250)
Ki 36±n/a nM
Citation Sams, AGMikkelsen, GKLarsen, MLanggård, MHowells, MESchrøder, TJBrennum, LTTorup, LJørgensen, EBBundgaard, CKreilgård, MBang-Andersen, B Discovery of phosphoric acid mono-{2-[(E/Z)-4-(3,3-dimethyl-butyrylamino)-3,5-difluoro-benzoylimino]-thiazol-3-ylmethyl} ester (Lu AA47070): a phosphonooxymethylene prodrug of a potent and selective hA(2A) receptor antagonist. J Med Chem54:751-64 (2012) 
 
Adenosine receptor A2a
Name:Adenosine receptor A2a
Type:G Protein-Coupled Receptor (GPCR)
Mol. Mass.:44716.46
Organism:Homo sapiens (Human)
Description:P29274
Residue:412
BDBM50336729
NameBDBM50336729
Synonyms:4-(3,3-Dimethyl-butyrylamino)-N-thiazol-2-yl-benzamide | CHEMBL1671922
TypeSmall organic molecule
Emp. Form.C16H19N3O2S
Mol. Mass.317.406
SMILESCC(C)(C)CC(=O)Nc1ccc(cc1)C(=O)Nc1nccs1