Reaction Details
TargetAdenosine receptor A2a
LigandBDBM50336713
Substrate/Competitorn/a
Meas. Tech.ChEMBL_718204 (CHEMBL1679250)
Ki 32±n/a nM
Citation Sams, AGMikkelsen, GKLarsen, MLanggård, MHowells, MESchrøder, TJBrennum, LTTorup, LJørgensen, EBBundgaard, CKreilgård, MBang-Andersen, B Discovery of phosphoric acid mono-{2-[(E/Z)-4-(3,3-dimethyl-butyrylamino)-3,5-difluoro-benzoylimino]-thiazol-3-ylmethyl} ester (Lu AA47070): a phosphonooxymethylene prodrug of a potent and selective hA(2A) receptor antagonist. J Med Chem54:751-64 (2012) 
 
Adenosine receptor A2a
Name:Adenosine receptor A2a
Type:G Protein-Coupled Receptor (GPCR)
Mol. Mass.:44716.46
Organism:Homo sapiens (Human)
Description:P29274
Residue:412
BDBM50336713
NameBDBM50336713
Synonyms:3-Chloro-4-(3,3-dimethyl-butyrylamino)-5-methyl-N-thiazol-2-yl-benzamide | CHEMBL1671937
TypeSmall organic molecule
Emp. Form.C17H20ClN3O2S
Mol. Mass.365.878
SMILESCc1cc(cc(Cl)c1NC(=O)CC(C)(C)C)C(=O)Nc1nccs1