Reaction Details
TargetSteroid hormone receptor ERR1
LigandBDBM50336748
Substrate/Competitorn/a
Meas. Tech.ChEMBL_718276 (CHEMBL1679580)
IC50>10000±n/a nM
Citation Patch, RJSearle, LLKim, AJDe, DZhu, XAskari, HBO'Neill, JCAbad, MCRentzeperis, DLiu, JKemmerer, MLin, LKasturi, JGeisler, JGLenhard, JMPlayer, MRGaul, MD Identification of diaryl ether-based ligands for estrogen-related receptora as potential antidiabetic agents. J Med Chem54:788-808 (2012) 
 
Steroid hormone receptor ERR1
Name:Steroid hormone receptor ERR1
Type:PROTEIN
Mol. Mass.:45508.08
Organism:Homo sapiens (Human)
Description:ChEMBL_1499891
Residue:423
BDBM50336748
NameBDBM50336748
Synonyms:5-[3-Methoxy-4-(2-nitrophenoxy)benzylidene]thiazolidine-2,4-dione | CHEMBL1671956
TypeSmall organic molecule
Emp. Form.C17H12N2O6S
Mol. Mass.372.352
SMILESCOc1cc(C=C2SC(O)=NC2=O)ccc1Oc1ccccc1[N+]([O-])=O