Reaction Details
TargetSteroid hormone receptor ERR1
LigandBDBM50155833
Substrate/Competitorn/a
Meas. Tech.ChEMBL_718276 (CHEMBL1679580)
IC50 370±n/a nM
Citation Patch, RJSearle, LLKim, AJDe, DZhu, XAskari, HBO'Neill, JCAbad, MCRentzeperis, DLiu, JKemmerer, MLin, LKasturi, JGeisler, JGLenhard, JMPlayer, MRGaul, MD Identification of diaryl ether-based ligands for estrogen-related receptora as potential antidiabetic agents. J Med Chem54:788-808 (2012) 
 
Steroid hormone receptor ERR1
Name:Steroid hormone receptor ERR1
Type:PROTEIN
Mol. Mass.:45508.08
Organism:Homo sapiens (Human)
Description:ChEMBL_1499891
Residue:423
BDBM50155833
NameBDBM50155833
Synonyms:3-[4-(2,4-Bis-trifluoromethyl-benzyloxy)-3-methoxy-phenyl]-2-cyano-N-(5-trifluoromethyl-[1,3,4]thiadiazol-2-yl)-acrylamide | CHEMBL189753
TypeSmall organic molecule
Emp. Form.C23H13F9N4O3S
Mol. Mass.596.425
SMILESCOc1cc(\C=C(/C#N)C(=O)Nc2nnc(s2)C(F)(F)F)ccc1OCc1ccc(cc1C(F)(F)F)C(F)(F)F